Target
Nitric oxide synthase, inducible
Ligand
BDBM50330875
Substrate
Meas. Tech.
ChEMBL_685656 (CHEMBL1285558)
Ki
48±n/a nM
Citation
 Ji, HDelker, SLLi, HMartásek, PRoman, LJPoulos, TLSilverman, RB Exploration of the active site of neuronal nitric oxide synthase by the design and synthesis of pyrrolidinomethyl 2-aminopyridine derivatives. J Med Chem 53:7804-24 (2010)  
Target
Name:
Nitric oxide synthase, inducible
Synonyms:
Inducible NO synthase Inducible nitric oxide synthase (iNOS) MAC-NOS NOS type II Nitric Oxide Synthase, inducible Nos2
Type:
Enzyme
Mol. Mass.:
130595.79
Organism:
Mus musculus (mouse)
Description:
Recombinant enzyme overexpressed in E. coli.
Residue:
1144
  
Inhibitor
Name:
BDBM50330875
Synonyms:
CHEMBL1233717 N-{(3S,4R)-4-[(6-amino-4-methylpyridin-2-yl)methyl]pyrrolidin-3-yl}-N'-[2-(3-fluorophenyl)ethyl]ethane-1,2-diamine | trans rac-N1-(4-((6-amino-4-methylpyridin-2-yl)methyl)pyrrolidin-3-yl)-N2-(3-fluorophenethyl)ethane-1,2-diamine
Type:
Small organic molecule
Emp. Form.:
C21H30FN5
Mol. Mass.:
371.4948
SMILES:
Cc1cc(N)nc(C[C@@H]2CNC[C@H]2NCCNCCc2cccc(F)c2)c1
: