Target
Serine/threonine-protein kinase B-raf
Ligand
BDBM50026208
Substrate
Meas. Tech.
ChEMBL_685663 (CHEMBL1285565)
IC50
<0.320000±n/a nM
Citation
 Wang, XBerger, DMSalaski, EJTorres, NDutia, MHanna, CHu, YLevin, JIPowell, DWojciechowicz, DCollins, KFrommer, ELucas, J Indazolylpyrazolopyrimidine as highly potent B-Raf inhibitors with in vivo activity. J Med Chem 53:7874-8 (2010)  
Target
Name:
Serine/threonine-protein kinase B-raf
Synonyms:
B-RAF B-Raf proto-oncogene serine/threonine-protein kinase BRAF1 RAFB1 v-Raf murine sarcoma viral oncogene homolog B1
Type:
Serine/threonine-protein kinase
Mol. Mass.:
84446.00
Organism:
Homo sapiens (Human)
Description:
P15056
Residue:
766
  
Inhibitor
Name:
BDBM50026208
Synonyms:
CHEMBL1276193
Type:
Small organic molecule
Emp. Form.:
C31H26F2N8
Mol. Mass.:
548.5885
SMILES:
[H][C@]12CN(c3cc(F)c(c(F)c3)-c3ccnc4c(c(nn34)-c3ccncc3)-c3cccc4[nH]ncc34)[C@]([H])(CN1CC)C2
: