Target
Sodium-dependent dopamine transporter
Ligand
BDBM50330964
Substrate
Meas. Tech.
ChEMBL_684105 (CHEMBL1286482)
EC50
1820±n/a nM
Citation
 Zhang, JLiu, XLei, XWang, LGuo, LZhao, GLin, G Discovery and synthesis of novel luteolin derivatives as DAT agonists. Bioorg Med Chem 18:7842-8 (2010)  
Target
Name:
Sodium-dependent dopamine transporter
Synonyms:
DA transporter SC6A3_RAT Sodium-dependent dopamine transporter | Sodium-dependent dopamine transporter (DAT)
Type:
Multi-pass membrane protein
Mol. Mass.:
68749.45
Organism:
Rattus norvegicus (rat)
Description:
P23977
Residue:
619
  
Inhibitor
Name:
BDBM50330964
Synonyms:
2-(3,4-dihydroxyphenyl)-7-hydroxy-4-oxo-4H-chromen-5-ylbutyrate | CHEMBL1277333
Type:
Small organic molecule
Emp. Form.:
C19H16O7
Mol. Mass.:
356.3261
SMILES:
CCCC(=O)Oc1cc(O)cc2oc(cc(=O)c12)-c1ccc(O)c(O)c1
: