Target
Sodium-dependent dopamine transporter
Ligand
BDBM50330982
Substrate
Meas. Tech.
ChEMBL_684105 (CHEMBL1286482)
EC50
1696±n/a nM
Citation
 Zhang, JLiu, XLei, XWang, LGuo, LZhao, GLin, G Discovery and synthesis of novel luteolin derivatives as DAT agonists. Bioorg Med Chem 18:7842-8 (2010)  
Target
Name:
Sodium-dependent dopamine transporter
Synonyms:
DA transporter SC6A3_RAT Sodium-dependent dopamine transporter | Sodium-dependent dopamine transporter (DAT)
Type:
Multi-pass membrane protein
Mol. Mass.:
68749.45
Organism:
Rattus norvegicus (rat)
Description:
P23977
Residue:
619
  
Inhibitor
Name:
BDBM50330982
Synonyms:
2-(3,4-Dihydroxyphenyl)-5-hydroxy-4-oxo-4H-chromen-7-ylpropionate | CHEMBL1278139
Type:
Small organic molecule
Emp. Form.:
C18H14O7
Mol. Mass.:
342.2996
SMILES:
CCC(=O)Oc1cc(O)c2c(c1)oc(cc2=O)-c1ccc(O)c(O)c1
: