Target
Platelet-derived growth factor receptor beta
Ligand
BDBM50331032
Substrate
Meas. Tech.
ChEMBL_684762 (CHEMBL1285789)
IC50
11±n/a nM
Citation
 Cho, TPDong, SYJun, FHong, FJLiang, YJLu, XHua, PJLi, LYLei, ZBing, HYing, ZQiong, LFBei, FBGuang, LLShen, GAHong, SGHong, SWTai, MX Novel potent orally active multitargeted receptor tyrosine kinase inhibitors: synthesis, structure-activity relationships, and antitumor activities of 2-indolinone derivatives. J Med Chem 53:8140-9 (2010)  
Target
Name:
Platelet-derived growth factor receptor beta
Synonyms:
Beta-type platelet-derived growth factor receptor CD140b antigen PDGF Receptor Substrate PDGFR PDGFR-1 PDGFRB PGFRB_HUMAN Platelet-derived growth factor receptor 1 Platelet-derived growth factor receptor beta (PDGFR-beta) Platelet-derived growth factor receptor beta (PDGFRbeta) | VHL/PDGFRB
Type:
Enzyme
Mol. Mass.:
123922.25
Organism:
Homo sapiens (Human)
Description:
P09619
Residue:
1106
  
Inhibitor
Name:
BDBM50331032
Synonyms:
(R,Z)-2-(5-Fluoro-2-oxo-1,2-dihydro-indol-3-ylidenemethyl)-5-(2-hydroxy-3-morpholin-4-ylpropyl)-3-methyl-5,6,7,8-tetrahydro-1H-pyrrolo[3,2-c]azepin-4-one | CHEMBL1277072
Type:
Small organic molecule
Emp. Form.:
C25H29FN4O4
Mol. Mass.:
468.5206
SMILES:
Cc1c(\C=C2/C(=O)Nc3ccc(F)cc23)[nH]c2CCCN(C[C@H](O)CN3CCOCC3)C(=O)c12
: