Target
Vascular endothelial growth factor receptor 2
Ligand
BDBM50331032
Substrate
Meas. Tech.
ChEMBL_684763 (CHEMBL1285790)
IC50
26±n/a nM
Citation
 Cho, TPDong, SYJun, FHong, FJLiang, YJLu, XHua, PJLi, LYLei, ZBing, HYing, ZQiong, LFBei, FBGuang, LLShen, GAHong, SGHong, SWTai, MX Novel potent orally active multitargeted receptor tyrosine kinase inhibitors: synthesis, structure-activity relationships, and antitumor activities of 2-indolinone derivatives. J Med Chem 53:8140-9 (2010)  
Target
Name:
Vascular endothelial growth factor receptor 2
Synonyms:
CD_antigen=CD309 Fetal liver kinase 1 (FLK-1) KDR Protein-tyrosine kinase receptor Flk-1 VEGFR-2 VEGFR2 Vascular Endothelial Growth Factor Receptor Kinase 2 Vascular endothelial growth factor receptor 2 (KDR) Vascular endothelial growth factor receptor 2 (VEGFR2) Vascular endothelial growth factor receptor-2 (VEGFR-2)
Type:
Receptor Tyrosine Kinase
Mol. Mass.:
151510.97
Organism:
Homo sapiens (Human)
Description:
P35968
Residue:
1356
  
Inhibitor
Name:
BDBM50331032
Synonyms:
(R,Z)-2-(5-Fluoro-2-oxo-1,2-dihydro-indol-3-ylidenemethyl)-5-(2-hydroxy-3-morpholin-4-ylpropyl)-3-methyl-5,6,7,8-tetrahydro-1H-pyrrolo[3,2-c]azepin-4-one | CHEMBL1277072
Type:
Small organic molecule
Emp. Form.:
C25H29FN4O4
Mol. Mass.:
468.5206
SMILES:
Cc1c(\C=C2/C(=O)Nc3ccc(F)cc23)[nH]c2CCCN(C[C@H](O)CN3CCOCC3)C(=O)c12
: