Target
Histone deacetylase 6
Ligand
BDBM50261816
Substrate
Meas. Tech.
ChEMBL_686302 (CHEMBL1293058)
IC50
27±n/a nM
Citation
 Gupta, PKReid, RCLiu, LLucke, AJBroomfield, SAAndrews, MRSweet, MJFairlie, DP Inhibitors selective for HDAC6 in enzymes and cells. Bioorg Med Chem Lett 20:7067-70 (2010)  
Target
Name:
Histone deacetylase 6
Synonyms:
Cereblon/Histone deacetylase 6 HDAC6 Histone deacetylase 6 (HDAC6) KIAA0901 | ORF Names:JM21
Type:
Chromatin regulator; hydrolase; repressor
Mol. Mass.:
131381.51
Organism:
Homo sapiens (Human)
Description:
Q9UBN7
Residue:
1215
  
Inhibitor
Name:
BDBM50261816
Synonyms:
CHEMBL511749 | tert-butyl 4-(3-((7-(hydroxyamino)-7-oxoheptyl)carbamoyl)isoxazol-5-yl)phenylcarbamate
Type:
Small organic molecule
Emp. Form.:
C22H30N4O6
Mol. Mass.:
446.4968
SMILES:
CC(C)(C)OC(=O)Nc1ccc(cc1)-c1cc(no1)C(=O)NCCCCCCC(=O)NO
: