Target
Glutamate receptor 2
Ligand
BDBM50331389
Substrate
Meas. Tech.
ChEMBL_687157 (CHEMBL1291782)
EC50
300±n/a nM
Citation
 Thewlis, KMAldegheri, LHarries, MHMookherjee, COliosi, BWard, SE N-substituted pyrrolidines and tetrahydrofurans as novel AMPAR positive modulators. Bioorg Med Chem Lett 20:7116-9 (2010)  
Target
Name:
Glutamate receptor 2
Synonyms:
AMPA-selective glutamate receptor 2 GRIA2 GluR-2 GluR-K2 Glutamate receptor 2 Glutamate receptor AMPA 2/3 Glutamate receptor ionotropic, AMPA 2
Type:
Enzyme Catalytic Domain
Mol. Mass.:
98825.96
Organism:
Homo sapiens (Human)
Description:
Glutamate AMPA 2 GRIA2 HUMAN::P42262
Residue:
883
  
Inhibitor
Name:
BDBM50331389
Synonyms:
CHEMBL1289409 | N-((3S,4S)-4-(4-(5-fluoropyridin-2-yl)phenyl)tetrahydrofuran-3-yl)propane-2-sulfonamide
Type:
Small organic molecule
Emp. Form.:
C18H21FN2O3S
Mol. Mass.:
364.434
SMILES:
CC(C)S(=O)(=O)N[C@@H]1COC[C@@H]1c1ccc(cc1)-c1ccc(F)cn1
: