Target
Cathepsin S
Ligand
BDBM50331575
Substrate
Meas. Tech.
ChEMBL_687416 (CHEMBL1292092)
IC50
1.9±n/a nM
Citation
 Cai, JRobinson, JBelshaw, SEverett, KFradera, Xvan Zeeland, Mvan Berkom, Lvan Rijnsbergen, PPopplestone, LBaugh, MDempster, MBruin, JHamilton, WKinghorn, EWestwood, PKerr, JRankovic, ZArbuckle, WBennett, DJJones, PSLong, CMartin, IUitdehaag, JCMeulemans, T Trifluoromethylphenyl as P2 for ketoamide-based cathepsin S inhibitors. Bioorg Med Chem Lett 20:6890-4 (2010)  
Target
Name:
Cathepsin S
Synonyms:
CATS_HUMAN Cathepsin S (Cat S) | cathepsin S preproprotein
Type:
Protein
Mol. Mass.:
37507.38
Organism:
Homo sapiens (Human)
Description:
P25774
Residue:
331
  
Inhibitor
Name:
BDBM50331575
Synonyms:
2-chloro-N-(1-(1-methyl-1H-pyrazol-3-ylamino)-1,2-dioxoheptan-3-yl)-4-(pyridin-2-ylmethoxy)-3-(trifluoromethyl)benzamide | CHEMBL1289750
Type:
Small organic molecule
Emp. Form.:
C25H25ClF3N5O4
Mol. Mass.:
551.945
SMILES:
CCCCC(NC(=O)c1ccc(OCc2ccccn2)c(c1Cl)C(F)(F)F)C(=O)C(=O)Nc1ccn(C)n1
: