Target
Epidermal growth factor receptor
Ligand
BDBM50331617
Substrate
Meas. Tech.
ChEMBL_687449 (CHEMBL1292125)
Ki
3450±n/a nM
Citation
 Krug, MErlenkamp, GSippl, WSchächtele, CTotzke, FHilgeroth, A Discovery and selectivity-profiling of 4-benzylamino 1-aza-9-oxafluorene derivatives as lead structures for IGF-1R inhibitors. Bioorg Med Chem Lett 20:6915-9 (2010)  
Target
Name:
Epidermal growth factor receptor
Synonyms:
EGF Receptor Substrate EGFR_HUMAN ERBB1 Epidermal Growth Factor Receptor erbB-1 Epidermal growth factor receptor (EGFR) HER1 Proto-oncogene c-ErbB-1 Tyrosine-Protein Kinase ErbB-1
Type:
Receptor Kinase Domain
Mol. Mass.:
134279.59
Organism:
Homo sapiens (Human)
Description:
P00533
Residue:
1210
  
Inhibitor
Name:
BDBM50331617
Synonyms:
CHEMBL1289977 | N-phenethylbenzofuro[2,3-b]pyridin-4-amine
Type:
Small organic molecule
Emp. Form.:
C19H16N2O
Mol. Mass.:
288.3431
SMILES:
C(Cc1ccccc1)Nc1ccnc2oc3ccccc3c12
: