Target
Prostaglandin D2 receptor
Ligand
BDBM50331740
Substrate
Meas. Tech.
ChEMBL_687945 (CHEMBL1291617)
Ki
0.51±n/a nM
Citation
 Li, LBeaulieu, CCarriere, MCDenis, DGreig, GGuay, DO'Neill, GZamboni, RWang, Z Potent and highly selective DP1 antagonists with 2,3,4,9-tetrahydro-1H-carbazole as pharmacophore. Bioorg Med Chem Lett 20:7462-5 (2010)  
Target
Name:
Prostaglandin D2 receptor
Synonyms:
PD2R_HUMAN Prostaglandin D2 Prostanoid DP receptor
Type:
Enzyme
Mol. Mass.:
40288.87
Organism:
Homo sapiens (Human)
Description:
Q13258
Residue:
359
  
Inhibitor
Name:
BDBM50331740
Synonyms:
2-((R)-9-((S)-1-(4-cyanophenyl)ethyl)-6-fluoro-8-(methylsulfonyl)-2,3,4,9-tetrahydro-1H-carbazol-1-yl)acetic acid | CHEMBL1290524
Type:
Small organic molecule
Emp. Form.:
C24H23FN2O4S
Mol. Mass.:
454.514
SMILES:
C[C@@H](c1ccc(cc1)C#N)n1c2[C@@H](CC(O)=O)CCCc2c2cc(F)cc(c12)S(C)(=O)=O
: