Target
Prostaglandin D2 receptor
Ligand
BDBM50331742
Substrate
Meas. Tech.
ChEMBL_687945 (CHEMBL1291617)
Ki
0.36±n/a nM
Citation
 Li, LBeaulieu, CCarriere, MCDenis, DGreig, GGuay, DO'Neill, GZamboni, RWang, Z Potent and highly selective DP1 antagonists with 2,3,4,9-tetrahydro-1H-carbazole as pharmacophore. Bioorg Med Chem Lett 20:7462-5 (2010)  
Target
Name:
Prostaglandin D2 receptor
Synonyms:
PD2R_HUMAN Prostaglandin D2 Prostanoid DP receptor
Type:
Enzyme
Mol. Mass.:
40288.87
Organism:
Homo sapiens (Human)
Description:
Q13258
Residue:
359
  
Inhibitor
Name:
BDBM50331742
Synonyms:
2-((R)-9-((R)-1-(4-chlorophenyl)-2-fluoroethyl)-6-fluoro-8-(methylsulfonyl)-2,3,4,9-tetrahydro-1H-carbazol-1-yl)acetic acid | CHEMBL1290639
Type:
Small organic molecule
Emp. Form.:
C23H22ClF2NO4S
Mol. Mass.:
481.94
SMILES:
CS(=O)(=O)c1cc(F)cc2c3CCC[C@H](CC(O)=O)c3n([C@@H](CF)c3ccc(Cl)cc3)c12
: