Target
Polyphenol oxidase 2
Ligand
BDBM50133496
Substrate
Meas. Tech.
ChEMBL_686723 (CHEMBL1290903)
IC50
250000±n/a nM
Citation
 Fujimoto, AShingai, YNakamura, MMaekawa, TSone, YMasuda, T A novel ring-expanded product with enhanced tyrosinase inhibitory activity from classical Fe-catalyzed oxidation of rosmarinic acid, a potent antioxidative Lamiaceae polyphenol. Bioorg Med Chem Lett 20:7393-6 (2010)  
Target
Name:
Polyphenol oxidase 2
Synonyms:
Monophenol monooxygenase PPO2 Tyrosinase
Type:
Protein
Mol. Mass.:
63923.66
Organism:
Agaricus bisporus (Common mushroom)
Description:
O42713
Residue:
556
  
Inhibitor
Name:
BDBM50133496
Synonyms:
(2R)-3-(3,4-dihydroxyphenyl)-2-[(2E)-3-(3,4-dihydroxyphenyl)prop-2-enoyloxy]propanoic acid CHEMBL324842 US10688093, Compound rosmarinic acid cid_5281792
Type:
Small organic molecule
Emp. Form.:
C18H16O8
Mol. Mass.:
360.3148
SMILES:
OC(=O)[C@@H](Cc1ccc(O)c(O)c1)OC(=O)\C=C\c1ccc(O)c(O)c1
: