Target
Adenosine receptor A1
Ligand
BDBM50331933
Substrate
Meas. Tech.
ChEMBL_687326 (CHEMBL1292002)
Ki
12±n/a nM
Citation
 McGuinness, BFHo, KKStauffer, TMRokosz, LLMannava, NKultgen, SGSaionz, KKlon, AChen, WDesai, HRogers, WLWebb, MYin, JJiang, YLi, TYan, HJing, KZhang, SMajumdar, KKSrivastava, VSaha, S Discovery of novel quinolinone adenosine A2B antagonists. Bioorg Med Chem Lett 20:7414-20 (2010)  
Target
Name:
Adenosine receptor A1
Synonyms:
A1 adenosine receptor (hA1) AA1R_HUMAN ADORA1 Adenosine A1-receptor Adenosine receptor A1 (hA1) | Adenosine transporter (AdT)
Type:
G Protein-Coupled Receptor (GPCR)
Mol. Mass.:
36520.92
Organism:
Homo sapiens (Human)
Description:
P30542
Residue:
326
  
Inhibitor
Name:
BDBM50331933
Synonyms:
2-(3-(3-methylisoxazol-5-yl)-2-oxo-4-phenethyl-1,2-dihydroquinolin-6-yloxy)-N-(2-phenylpropan-2-yl)acetamide | CHEMBL1290102
Type:
Small organic molecule
Emp. Form.:
C32H31N3O4
Mol. Mass.:
521.6062
SMILES:
Cc1cc(on1)-c1c(CCc2ccccc2)c2cc(OCC(=O)NC(C)(C)c3ccccc3)ccc2[nH]c1=O
: