Target
Metabotropic glutamate receptor 5
Ligand
BDBM50331986
Substrate
Meas. Tech.
ChEMBL_687528 (CHEMBL1292204)
EC50
390±n/a nM
Citation
 Xiong, HBrugel, TABalestra, MBrown, DGBrush, KAHightower, CHinkley, LHoesch, VKang, JKoether, GMMcCauley, JPMcLaren, FMPanko, LMSimpson, TRSmith, RWWoods, JMBrockel, BChhajlani, VGadient, RASpear, NSygowski, LAZhang, MArora, JBreysse, NWilson, JMIsaac, MSlassi, AKing, MM 4-aryl piperazine and piperidine amides as novel mGluR5 positive allosteric modulators. Bioorg Med Chem Lett 20:7381-4 (2010)  
Target
Name:
Metabotropic glutamate receptor 5
Synonyms:
GPRC1E GRM5_HUMAN metabotropic glutamate 5 | metabotropic glutamate 5a
Type:
Enzyme
Mol. Mass.:
132484.72
Organism:
Homo sapiens (Human)
Description:
Residue:
1212
  
Inhibitor
Name:
BDBM50331986
Synonyms:
1-(4-(2,4-dichlorophenyl)piperidin-1-yl)-2-(pyridin-4-ylmethoxy)ethanone | CHEMBL1289466
Type:
Small organic molecule
Emp. Form.:
C19H20Cl2N2O2
Mol. Mass.:
379.28
SMILES:
Clc1ccc(C2CCN(CC2)C(=O)COCc2ccncc2)c(Cl)c1
: