Target
Metabotropic glutamate receptor 5
Ligand
BDBM50331994
Substrate
Meas. Tech.
ChEMBL_687528 (CHEMBL1292204)
EC50
1100±n/a nM
Citation
 Xiong, HBrugel, TABalestra, MBrown, DGBrush, KAHightower, CHinkley, LHoesch, VKang, JKoether, GMMcCauley, JPMcLaren, FMPanko, LMSimpson, TRSmith, RWWoods, JMBrockel, BChhajlani, VGadient, RASpear, NSygowski, LAZhang, MArora, JBreysse, NWilson, JMIsaac, MSlassi, AKing, MM 4-aryl piperazine and piperidine amides as novel mGluR5 positive allosteric modulators. Bioorg Med Chem Lett 20:7381-4 (2010)  
Target
Name:
Metabotropic glutamate receptor 5
Synonyms:
GPRC1E GRM5_HUMAN metabotropic glutamate 5 | metabotropic glutamate 5a
Type:
Enzyme
Mol. Mass.:
132484.72
Organism:
Homo sapiens (Human)
Description:
Residue:
1212
  
Inhibitor
Name:
BDBM50331994
Synonyms:
2-(benzyloxy)-1-(4-(4-fluorophenyl)piperazin-1-yl)ethanone | CHEMBL1290668
Type:
Small organic molecule
Emp. Form.:
C19H21FN2O2
Mol. Mass.:
328.3806
SMILES:
Fc1ccc(cc1)N1CCN(CC1)C(=O)COCc1ccccc1
: