Target
Metabotropic glutamate receptor 5
Ligand
BDBM50332004
Substrate
Meas. Tech.
ChEMBL_687528 (CHEMBL1292204)
EC50
7100±n/a nM
Citation
 Xiong, HBrugel, TABalestra, MBrown, DGBrush, KAHightower, CHinkley, LHoesch, VKang, JKoether, GMMcCauley, JPMcLaren, FMPanko, LMSimpson, TRSmith, RWWoods, JMBrockel, BChhajlani, VGadient, RASpear, NSygowski, LAZhang, MArora, JBreysse, NWilson, JMIsaac, MSlassi, AKing, MM 4-aryl piperazine and piperidine amides as novel mGluR5 positive allosteric modulators. Bioorg Med Chem Lett 20:7381-4 (2010)  
Target
Name:
Metabotropic glutamate receptor 5
Synonyms:
GPRC1E GRM5_HUMAN metabotropic glutamate 5 | metabotropic glutamate 5a
Type:
Enzyme
Mol. Mass.:
132484.72
Organism:
Homo sapiens (Human)
Description:
Residue:
1212
  
Inhibitor
Name:
BDBM50332004
Synonyms:
2-(benzyloxy)-1-(4-phenylpiperazin-1-yl)ethanone | CHEMBL1290441
Type:
Small organic molecule
Emp. Form.:
C19H22N2O2
Mol. Mass.:
310.3902
SMILES:
O=C(COCc1ccccc1)N1CCN(CC1)c1ccccc1
: