Target
Ectonucleotide pyrophosphatase/phosphodiesterase family member 2
Ligand
BDBM50332460
Substrate
Meas. Tech.
ChEMBL_695427 (CHEMBL1639097)
Ki
1600±n/a nM
Citation
 Gupte, RSiddam, ALu, YLi, WFujiwara, YPanupinthu, NPham, TCBaker, DLParrill, ALGotoh, MMurakami-Murofushi, KKobayashi, SMills, GBTigyi, GMiller, DD Synthesis and pharmacological evaluation of the stereoisomers of 3-carba cyclic-phosphatidic acid. Bioorg Med Chem Lett 20:7525-8 (2010)  
Target
Name:
Ectonucleotide pyrophosphatase/phosphodiesterase family member 2
Synonyms:
ATX Autotaxin (ATX) ENPP2 Ectonucleotide Pyrophosphatase/Phosphodiesterase 2 (ENPP2) Extracellular lysophospholipase D PDNP2
Type:
Enzyme
Mol. Mass.:
99007.13
Organism:
Homo sapiens (Human)
Description:
Q13822
Residue:
863
  
Inhibitor
Name:
BDBM50332460
Synonyms:
(S)-carba cyclic-phosphatidic acid | CHEMBL1630084
Type:
Small organic molecule
Emp. Form.:
C22H42O5P
Mol. Mass.:
417.5402
SMILES:
CCCCCCCCCCCCCCCCCC(=O)OC[C@@H]1CCP([O-])(=O)O1
: