Target
Disintegrin and metalloproteinase domain-containing protein 17
Ligand
BDBM50332478
Substrate
Meas. Tech.
ChEMBL_697248 (CHEMBL1640792)
IC50
0.530000±n/a nM
Citation
 Yang, JSChun, KPark, JECho, MSeo, JSong, DYoon, HPark, CHJoe, BYChoi, JHKim, MHHan, G Structure based optimization of chromen-based TNF-a converting enzyme (TACE) inhibitors on S1' pocket and their quantitative structure-activity relationship (QSAR) study. Bioorg Med Chem 18:8618-29 (2010)  
Target
Name:
Disintegrin and metalloproteinase domain-containing protein 17
Synonyms:
ADA17_HUMAN CSVP Disintegrin and metalloproteinase domain-containing protein 17 (ADAM17) TNF-alpha convertase TNF-alpha-converting enzyme (TACE) Tumor necrosis factor-α converting enzyme (TACE)
Type:
Enzyme
Mol. Mass.:
93007.89
Organism:
Homo sapiens (Human)
Description:
Residue:
824
  
Inhibitor
Name:
BDBM50332478
Synonyms:
4-(4-(2-(Diethylamino)ethoxy)phenyl)-2-((6-methyl-2-oxo-2H-chromen-3-yl)-methyl)-butanoic acid hydroxyamide | CHEMBL1630089
Type:
Small organic molecule
Emp. Form.:
C27H34N2O5
Mol. Mass.:
466.5693
SMILES:
CCN(CC)CCOc1ccc(CCC(Cc2cc3cc(C)ccc3oc2=O)C(=O)NO)cc1
: