Target
Aldehyde oxidase
Ligand
BDBM19441
Substrate
Meas. Tech.
ChEMBL_696364 (CHEMBL1640077)
IC50
3±n/a nM
Citation
 Pryde, DCDalvie, DHu, QJones, PObach, RSTran, TD Aldehyde oxidase: an enzyme of emerging importance in drug discovery. J Med Chem 53:8441-60 (2010)  
Target
Name:
Aldehyde oxidase
Synonyms:
AO AOXA_HUMAN | Aldehyde oxidase
Type:
PROTEIN
Mol. Mass.:
147930.97
Organism:
Homo sapiens (Human)
Description:
ChEMBL_1481150
Residue:
1338
  
Inhibitor
Name:
BDBM19441
Synonyms:
2-(4-hydroxyphenyl)-3-({4-[2-(piperidin-1-yl)ethoxy]phenyl}carbonyl)-1-benzothiophen-6-ol Evista RALOXIFENE HYDROCHLORIDE Raloxifene (7) [6-hydroxy-2-(4-hydroxyphenyl)-1-benzothiophen-3-yl]-[4-(2-piperidin-1-ylethoxy)phenyl]methanone | cid_11071264
Type:
Small organic molecule
Emp. Form.:
C28H27NO4S
Mol. Mass.:
473.583
SMILES:
Oc1ccc(cc1)-c1sc2cc(O)ccc2c1C(=O)c1ccc(OCCN2CCCCC2)cc1
: