Target
Matrilysin
Ligand
BDBM50332948
Substrate
Meas. Tech.
ChEMBL_694545 (CHEMBL1635954)
Ki
344±n/a nM
Citation
 Attolino, ECalderone, VDragoni, EFragai, MRichichi, BLuchinat, CNativi, C Structure-based approach to nanomolar, water soluble matrix metalloproteinases inhibitors (MMPIs). Eur J Med Chem 45:5919-25 (2010)  
Target
Name:
Matrilysin
Synonyms:
MMP7 MPSL1 Matrix metalloproteinase-7 (MMP-7) PUMP1
Type:
Enzyme
Mol. Mass.:
29681.54
Organism:
Homo sapiens (Human)
Description:
P09237
Residue:
267
  
Inhibitor
Name:
BDBM50332948
Synonyms:
(R)-2-(N-((S)-2,3-dihydroxypropyl)-4-methoxyphenylsulfonamido)-N,3-dihydroxypropanamide | CHEMBL1632638
Type:
Small organic molecule
Emp. Form.:
C13H20N2O8S
Mol. Mass.:
364.371
SMILES:
COc1ccc(cc1)S(=O)(=O)N(C[C@H](O)CO)[C@H](CO)C(=O)NO
: