Target
Cytochrome P450 2C9
Ligand
BDBM50417554
Substrate
Meas. Tech.
ChEMBL_692841 (CHEMBL1637355)
IC50
>17500±n/a nM
Citation
 Damle, BDDowell, JAWalsky, RLWeber, GLStogniew, MInskeep, PB In vitro and in vivo studies to characterize the clearance mechanism and potential cytochrome P450 interactions of anidulafungin. Antimicrob Agents Chemother 53:1149-56 (2009)  
Target
Name:
Cytochrome P450 2C9
Synonyms:
(R)-limonene 6-monooxygenase CP2C9_HUMAN CYP2C9 Cytochrome P450 2C9 (CYP2C9 ) P-450MP P450 PB-1 | S-mephenytoin 4-hydroxylase
Type:
Enzyme
Mol. Mass.:
55636.33
Organism:
Homo sapiens (Human)
Description:
P11712
Residue:
490
  
Inhibitor
Name:
BDBM50417554
Synonyms:
ANIDULAFUNGIN
Type:
Small organic molecule
Emp. Form.:
C58H73N7O17
Mol. Mass.:
1140.2369
SMILES:
CCCCCOc1ccc(cc1)-c1ccc(cc1)-c1ccc(cc1)C(=O)N[C@H]1C[C@@H](O)[C@@H](O)NC(=O)[C@@H]2[C@@H](O)[C@@H](C)CN2C(=O)[C@@H](NC(=O)[C@@H](NC(=O)[C@@H]2C[C@@H](O)CN2C(=O)[C@@H](NC1=O)[C@@H](C)O)[C@H](O)[C@@H](O)c1ccc(O)cc1)[C@@H](C)O
: