Target
Inositol phosphorylceramide synthase
Ligand
BDBM50333124
Substrate
Meas. Tech.
ChEMBL_690931 (CHEMBL1634539)
Ki
7900±n/a nM
Citation
 Aeed, PAYoung, CLNagiec, MMElhammer, AP Inhibition of inositol phosphorylceramide synthase by the cyclic peptide aureobasidin A. Antimicrob Agents Chemother 53:496-504 (2009)  
Target
Name:
Inositol phosphorylceramide synthase
Synonyms:
AUR1 Aureobasidin A resistance protein homolog Phosphatidylinositol:ceramide phosphoinositol transferase
Type:
PROTEIN
Mol. Mass.:
53452.25
Organism:
Candida albicans
Description:
ChEMBL_690931
Residue:
471
  
Inhibitor
Name:
BDBM50333124
Synonyms:
(R)-2-((3,4-dimethoxyphenethyl)(methyl)amino)-2-oxo-1-phenylethyl 3-hydroxy-3-methyl-2-(N-methyl-2-propylpentanamido)butanoate | CHEMBL1631585
Type:
Small organic molecule
Emp. Form.:
C33H48N2O7
Mol. Mass.:
584.7434
SMILES:
CCCC(CCC)C(=O)N(C)C(C(=O)O[C@@H](C(=O)N(C)CCc1ccc(OC)c(OC)c1)c1ccccc1)C(C)(C)O
: