Target
Inositol phosphorylceramide synthase
Ligand
BDBM50333121
Substrate
Meas. Tech.
ChEMBL_690931 (CHEMBL1634539)
Ki
0.43±n/a nM
Citation
 Aeed, PAYoung, CLNagiec, MMElhammer, AP Inhibition of inositol phosphorylceramide synthase by the cyclic peptide aureobasidin A. Antimicrob Agents Chemother 53:496-504 (2009)  
Target
Name:
Inositol phosphorylceramide synthase
Synonyms:
AUR1 Aureobasidin A resistance protein homolog Phosphatidylinositol:ceramide phosphoinositol transferase
Type:
PROTEIN
Mol. Mass.:
53452.25
Organism:
Candida albicans
Description:
ChEMBL_690931
Residue:
471
  
Inhibitor
Name:
BDBM50333121
Synonyms:
CHEMBL1631582 | Khafrefungin
Type:
Small organic molecule
Emp. Form.:
C33H56O9
Mol. Mass.:
596.7923
SMILES:
CCCCCCCCCC[C@H](C)[C@@H](O)[C@@H](C)C=C(C)C=C(C)C(=O)[C@H](C)C=C(C)C(=O)O[C@H](CO)[C@@H](O)[C@H](O)C(O)=O
: