Target
Inositol phosphorylceramide synthase catalytic subunit AUR1
Ligand
BDBM50333121
Substrate
Meas. Tech.
ChEMBL_690933 (CHEMBL1634541)
IC50
11300±n/a nM
Citation
 Aeed, PAYoung, CLNagiec, MMElhammer, AP Inhibition of inositol phosphorylceramide synthase by the cyclic peptide aureobasidin A. Antimicrob Agents Chemother 53:496-504 (2009)  
Target
Name:
Inositol phosphorylceramide synthase catalytic subunit AUR1
Synonyms:
AUR1 Aureobasidin A resistance protein Phosphatidylinositol:ceramide phosphoinositol transferase
Type:
PROTEIN
Mol. Mass.:
45190.29
Organism:
Saccharomyces cerevisiae S288c
Description:
ChEMBL_690933
Residue:
401
  
Inhibitor
Name:
BDBM50333121
Synonyms:
CHEMBL1631582 | Khafrefungin
Type:
Small organic molecule
Emp. Form.:
C33H56O9
Mol. Mass.:
596.7923
SMILES:
CCCCCCCCCC[C@H](C)[C@@H](O)[C@@H](C)C=C(C)C=C(C)C(=O)[C@H](C)C=C(C)C(=O)O[C@H](CO)[C@@H](O)[C@H](O)C(O)=O
: