Target
Amine oxidase [flavin-containing] A
Ligand
BDBM50333423
Substrate
Meas. Tech.
ChEMBL_698696 (CHEMBL1648260)
Ki
25±n/a nM
Citation
 Reniers, JRobert, SFrederick, RMasereel, BVincent, SWouters, J Synthesis and evaluation ofß-carboline derivatives as potential monoamine oxidase inhibitors. Bioorg Med Chem 19:134-44 (2011)  
Target
Name:
Amine oxidase [flavin-containing] A
Synonyms:
AOFA_HUMAN MAO-A Monoamine oxidase Monoamine oxidase type A (MAO A) Monoamine oxidase type A (MAOA)
Type:
Protein
Mol. Mass.:
59689.53
Organism:
Homo sapiens (Human)
Description:
P21397
Residue:
527
  
Inhibitor
Name:
BDBM50333423
Synonyms:
7-(Pyridin-3-ylmethoxy)-1-methyl-beta-carboline US9168247, JR212
Type:
Small organic molecule
Emp. Form.:
C18H15N3O
Mol. Mass.:
289.3312
SMILES:
Cc1nccc2c3ccc(OCc4cccnc4)cc3[nH]c12
: