Target
Prostaglandin D2 receptor
Ligand
BDBM50333502
Substrate
Meas. Tech.
ChEMBL_699227 (CHEMBL1646949)
Ki
>4000±n/a nM
Citation
 Simard, DLeblanc, YBerthelette, CZaghdane, MHMolinaro, CWang, ZGallant, MLau, SThao, THamel, MStocco, RSawyer, NSillaots, SGervais, FHoule, RLévesque, JF Azaindoles as potent CRTH2 receptor antagonists. Bioorg Med Chem Lett 21:841-5 (2011)  
Target
Name:
Prostaglandin D2 receptor
Synonyms:
PD2R_HUMAN Prostaglandin D2 Prostanoid DP receptor
Type:
Enzyme
Mol. Mass.:
40288.87
Organism:
Homo sapiens (Human)
Description:
Q13258
Residue:
359
  
Inhibitor
Name:
BDBM50333502
Synonyms:
(R)-2-(8-(1-(4-fluorophenyl)-N-methylcyclobutanecarboxamido)-6,7,8,9-tetrahydropyrido[3,2-b]indolizin-5-yl)acetic acid | CHEMBL1641816
Type:
Small organic molecule
Emp. Form.:
C25H26FN3O3
Mol. Mass.:
435.4906
SMILES:
CN([C@@H]1CCc2c(CC(O)=O)c3cccnc3n2C1)C(=O)C1(CCC1)c1ccc(F)cc1
: