Target
Insulin receptor
Ligand
BDBM50333558
Substrate
Meas. Tech.
ChEMBL_699678 (CHEMBL1648321)
IC50
20±n/a nM
Citation
 Zificsak, CATheroff, JPAimone, LDAlbom, MSAngeles, TSBrown, RAGalinis, DGrobelny, JVHerbertz, THusten, JKocsis, LSLoSardo, CMiknyoczki, SJMurthy, SRolon-Steele, DUnderiner, TLWells-Knecht, KJWorrell, CSZeigler, KSDorsey, BD 2,4-Diaminopyrimidine inhibitors of c-Met kinase bearing benzoxazepine anilines. Bioorg Med Chem Lett 21:660-3 (2011)  
Target
Name:
Insulin receptor
Synonyms:
INSR INSR_HUMAN Insulin receptor beta subunit
Type:
Receptor Tyrosine Kinase
Mol. Mass.:
156322.60
Organism:
Homo sapiens (Human)
Description:
P06213
Residue:
1382
  
Inhibitor
Name:
BDBM50333558
Synonyms:
2-{5-Chloro-2-[3-(2-methoxy-ethyl)-2,3,4,5-tetrahydro-1H-benzo[d]azepin-7-ylamino]-pyrimidin-4-ylamino}-N-methyl-benzamide | CHEMBL1642132
Type:
Small organic molecule
Emp. Form.:
C25H29ClN6O2
Mol. Mass.:
480.99
SMILES:
CNC(=O)c1ccccc1Nc1nc(Nc2ccc3CCN(CCOC)CCc3c2)ncc1Cl
: