Target
Carbonic anhydrase
Ligand
BDBM10883
Substrate
Meas. Tech.
ChEMBL_700659 (CHEMBL1645698)
Ki
79±n/a nM
Citation
 Bertucci, AInnocenti, AScozzafava, ATambutté, SZoccola, DSupuran, CT Carbonic anhydrase inhibitors. Inhibition studies with anions and sulfonamides of a new cytosolic enzyme from the scleractinian coral Stylophora pistillata. Bioorg Med Chem Lett 21:710-4 (2011)  
Target
Name:
Carbonic anhydrase
Synonyms:
Type:
PROTEIN
Mol. Mass.:
35119.71
Organism:
Stylophora pistillata
Description:
ChEMBL_700659
Residue:
316
  
Inhibitor
Name:
BDBM10883
Synonyms:
4,5-dichlorobenzene-1,3-disulfonamide Dichlorophenamide Dichlorophenamide, DCP US10172837, Dichlorphenamide | sulfonamide 4
Type:
Small organic molecule
Emp. Form.:
C6H6Cl2N2O4S2
Mol. Mass.:
305.159
SMILES:
NS(=O)(=O)c1cc(Cl)c(Cl)c(c1)S(N)(=O)=O
: