Target
Carboxylic ester hydrolase
Ligand
BDBM50333760
Substrate
Meas. Tech.
ChEMBL_700711 (CHEMBL1645750)
IC50
5.67±n/a nM
Citation
 Luo, WLi, YPHe, YHuang, SLTan, JHOu, TMLi, DGu, LQHuang, ZS Design, synthesis and evaluation of novel tacrine-multialkoxybenzene hybrids as dual inhibitors for cholinesterases and amyloid beta aggregation. Bioorg Med Chem 19:763-70 (2011)  
Target
Name:
Carboxylic ester hydrolase
Synonyms:
BuChE Butyrylcholine esterase Butyrylcholinesterase (BChE) Butyrylcholinesterase (EqBuChE) butyrylcholinesterase precursor
Type:
Protein
Mol. Mass.:
68842.83
Organism:
Equus caballus (Horse)
Description:
Q9N1N9
Residue:
602
  
Inhibitor
Name:
BDBM50333760
Synonyms:
CHEMBL1644295 | N1-(3,4-Dimethoxybenzyl)-N9-(1,2,3,4-tetrahydroacridin-9-yl)nonane-1,9-diamine
Type:
Small organic molecule
Emp. Form.:
C31H43N3O2
Mol. Mass.:
489.692
SMILES:
COc1ccc(CNCCCCCCCCCNc2c3CCCCc3nc3ccccc23)cc1OC
: