Target
Carboxylic ester hydrolase
Ligand
BDBM50333771
Substrate
Meas. Tech.
ChEMBL_700711 (CHEMBL1645750)
IC50
5.19±n/a nM
Citation
 Luo, WLi, YPHe, YHuang, SLTan, JHOu, TMLi, DGu, LQHuang, ZS Design, synthesis and evaluation of novel tacrine-multialkoxybenzene hybrids as dual inhibitors for cholinesterases and amyloid beta aggregation. Bioorg Med Chem 19:763-70 (2011)  
Target
Name:
Carboxylic ester hydrolase
Synonyms:
BuChE Butyrylcholine esterase Butyrylcholinesterase (BChE) Butyrylcholinesterase (EqBuChE) butyrylcholinesterase precursor
Type:
Protein
Mol. Mass.:
68842.83
Organism:
Equus caballus (Horse)
Description:
Q9N1N9
Residue:
602
  
Inhibitor
Name:
BDBM50333771
Synonyms:
CHEMBL1644284 | N1-((7-Methoxybenzo[d][1,3]dioxol-5-yl)methyl)-N6-(1,2,3,4-tetrahydroacridin-9-yl)hexane-1,6-diamine
Type:
Small organic molecule
Emp. Form.:
C28H35N3O3
Mol. Mass.:
461.5958
SMILES:
COc1cc(CNCCCCCCNc2c3CCCCc3nc3ccccc23)cc2OCOc12
: