Target
Prostaglandin D2 receptor 2
Ligand
BDBM50161745
Substrate
Meas. Tech.
ChEMBL_699801 (CHEMBL1645647)
Ki
6±n/a nM
Citation
 Gallant, MBeaulieu, CBerthelette, CColucci, JCrackower, MADalton, CDenis, DDucharme, YFriesen, RWGuay, DGervais, FGHamel, MHoule, RKrawczyk, CMKosjek, BLau, SLeblanc, YLee, EELevesque, JFMellon, CMolinaro, CMullet, WO'Neill, GPO'Shea, PSawyer, NSillaots, SSimard, DSlipetz, DStocco, RSørensen, DTruong, VLWong, EWu, JZaghdane, HWang, Z Discovery of MK-7246, a selective CRTH2 antagonist for the treatment of respiratory diseases. Bioorg Med Chem Lett 21:288-93 (2010)  
Target
Name:
Prostaglandin D2 receptor 2
Synonyms:
CD_antigen=CD294 Chemoattractant Receptor-homologous molecule expressed on T-helper type 2 cells (CRTH2) Chemoattractant receptor-homologous molecule expressed on Th2 cells (CRTH2) G protein-coupled receptor 44 GPR44 PTGDR2 Prostaglandin D2 receptor 2 | Prostaglandin D2 receptor 2 (PGD2)
Type:
Enzyme
Mol. Mass.:
43295.45
Organism:
Homo sapiens (Human)
Description:
Q9Y5Y4
Residue:
395
  
Inhibitor
Name:
BDBM50161745
Synonyms:
CHEMBL179036 | {3-[((R)-4-Fluoro-benzenesulfonyl)-methyl-amino]-1,2,3,4-tetrahydro-carbazol-9-yl}-acetic acid
Type:
Small organic molecule
Emp. Form.:
C21H21FN2O4S
Mol. Mass.:
416.466
SMILES:
CN([C@@H]1CCc2c(C1)c1ccccc1n2CC(O)=O)S(=O)(=O)c1ccc(F)cc1
: