Target
Thioredoxin reductase 1, cytoplasmic
Ligand
BDBM32021
Substrate
Meas. Tech.
ChEMBL_700048 (CHEMBL1646825)
IC50
84000±n/a nM
Citation
 Sorrentino, FKarioti, AGratteri, PRigobello, MPScutari, GMessori, LBindoli, AChioccioli, MGabbiani, CBergonzi, MCBilia, AR Hypericins and thioredoxin reductase: Biochemical and docking studies disclose the molecular basis for effective inhibition by naphthodianthrones. Bioorg Med Chem 19:631-41 (2011)  
Target
Name:
Thioredoxin reductase 1, cytoplasmic
Synonyms:
NADPH-dependent thioredoxin reductase TRXR1_RAT Trxr1 | Txnrd1
Type:
PROTEIN
Mol. Mass.:
54519.34
Organism:
Rattus norvegicus
Description:
ChEMBL_589950
Residue:
498
  
Inhibitor
Name:
BDBM32021
Synonyms:
4,5-bis(oxidanyl)-9,10-bis(oxidanylidene)anthracene-2-carboxylic acid 4,5-dihydroxy-9,10-dioxo-2-anthracenecarboxylic acid MLS000069639 SMR000058210 US9238626, Rhein | cid_10168
Type:
Small organic molecule
Emp. Form.:
C15H8O6
Mol. Mass.:
284.2204
SMILES:
OC(=O)c1cc(O)c2C(=O)c3c(O)cccc3C(=O)c2c1
: