Target
Sodium-dependent dopamine transporter
Ligand
BDBM50333959
Substrate
Meas. Tech.
ChEMBL_700296 (CHEMBL1647514)
IC50
201±n/a nM
Citation
 Angus, DBingham, MBuchanan, DDunbar, NGibson, LGoodwin, RHaunsø, AHoughton, AHuggett, MMorphy, RNapier, SNimz, OPassmore, JWalker, G The identification, and optimisation of hERG selectivity, of a mixed NET/SERT re-uptake inhibitor for the treatment of pain. Bioorg Med Chem Lett 21:271-5 (2010)  
Target
Name:
Sodium-dependent dopamine transporter
Synonyms:
DA transporter DAT1 Dopamine transporter protein (DAT) SC6A3_HUMAN Sodium-dependent dopamine transporter Solute carrier family 6 member 3
Type:
Multi-pass membrane protein
Mol. Mass.:
68497.11
Organism:
Homo sapiens (Human)
Description:
Q01959
Residue:
620
  
Inhibitor
Name:
BDBM50333959
Synonyms:
CHEMBL1644476 | exo-(1R,5S)-3-(3-bromophenoxy)-8-azabicyclo[3.2.1]octane
Type:
Small organic molecule
Emp. Form.:
C13H16BrNO
Mol. Mass.:
282.176
SMILES:
Brc1cccc(O[C@H]2C[C@@H]3CC[C@H](C2)N3)c1
: