Target
Prostaglandin E2 receptor EP4 subtype
Ligand
BDBM50334130
Substrate
Meas. Tech.
ChEMBL_698178 (CHEMBL1646483)
Ki
0.34±n/a nM
Citation
 Boyd, MJBerthelette, CChiasson, JFClark, PColucci, JDenis, DHan, YLévesque, JFMathieu, MCStocco, RTherien, ARowland, SWrona, MXu, D A novel series of potent and selective EP(4) receptor ligands: facile modulation of agonism and antagonism. Bioorg Med Chem Lett 21:484-7 (2010)  
Target
Name:
Prostaglandin E2 receptor EP4 subtype
Synonyms:
PE2R4_HUMAN PGE2 receptor EP4 subtype PTGER4 Prostanoid EP4 receptor
Type:
Enzyme
Mol. Mass.:
53134.53
Organism:
Homo sapiens (Human)
Description:
P35408
Residue:
488
  
Inhibitor
Name:
BDBM50334130
Synonyms:
(S)-4-(1-(1-(3,4-dichlorobenzyl)indoline-7-carboxamido)ethyl)benzoic acid | CHEMBL1645134
Type:
Small organic molecule
Emp. Form.:
C25H22Cl2N2O3
Mol. Mass.:
469.36
SMILES:
C[C@H](NC(=O)c1cccc2CCN(Cc3ccc(Cl)c(Cl)c3)c12)c1ccc(cc1)C(O)=O
: