Target
Nischarin
Ligand
BDBM50334194
Substrate
Meas. Tech.
ChEMBL_698560 (CHEMBL1647735)
Ki
133.6±n/a nM
Citation
 Saczewski, FKornicka, AHudson, ALLaird, SScheinin, MLaurila, JMRybczynska, ABoblewski, KLehmann, AGdaniec, M 3-[(Imidazolidin-2-yl)imino]indazole ligands with selectivity for thea(2)-adrenoceptor compared to the imidazoline I(1) receptor. Bioorg Med Chem 19:321-9 (2011)  
Target
Name:
Nischarin
Synonyms:
Imidazoline I1 Nisch | Nischarin
Type:
Enzyme Catalytic Domain
Mol. Mass.:
166460.59
Organism:
RAT
Description:
Q4G017
Residue:
1502
  
Inhibitor
Name:
BDBM50334194
Synonyms:
3-[(Imidazolidin-2-yl)imino]indazole hydrochloride | CHEMBL1641679
Type:
Small organic molecule
Emp. Form.:
C10H11N5
Mol. Mass.:
201.2278
SMILES:
C1CNC(N1)=Nc1[nH]nc2ccccc12
: