Target
Nischarin
Ligand
BDBM50334208
Substrate
Meas. Tech.
ChEMBL_698560 (CHEMBL1647735)
Ki
10200±n/a nM
Citation
 Saczewski, FKornicka, AHudson, ALLaird, SScheinin, MLaurila, JMRybczynska, ABoblewski, KLehmann, AGdaniec, M 3-[(Imidazolidin-2-yl)imino]indazole ligands with selectivity for thea(2)-adrenoceptor compared to the imidazoline I(1) receptor. Bioorg Med Chem 19:321-9 (2011)  
Target
Name:
Nischarin
Synonyms:
Imidazoline I1 Nisch | Nischarin
Type:
Enzyme Catalytic Domain
Mol. Mass.:
166460.59
Organism:
RAT
Description:
Q4G017
Residue:
1502
  
Inhibitor
Name:
BDBM50334208
Synonyms:
3-[(Imidazolidin-2-yl)imino]-5-methylindazole hydrochloride | CHEMBL1641685
Type:
Small organic molecule
Emp. Form.:
C11H13N5
Mol. Mass.:
215.2544
SMILES:
Cc1ccc2n[nH]c(N=C3NCCN3)c2c1
: