Target
Sodium-dependent dopamine transporter
Ligand
BDBM50062915
Substrate
Meas. Tech.
ChEMBL_698571 (CHEMBL1647746)
Ki
25±n/a nM
Citation
 Lapinsky, DJVelagaleti, RYarravarapu, NLiu, YHuang, YSurratt, CKLever, JRFoster, JDAcharya, RVaughan, RADeutsch, HM Azido-iodo-N-benzyl derivatives of threo-methylphenidate (Ritalin, Concerta): Rational design, synthesis, pharmacological evaluation, and dopamine transporter photoaffinity labeling. Bioorg Med Chem 19:504-12 (2011)  
Target
Name:
Sodium-dependent dopamine transporter
Synonyms:
DA transporter DAT1 Dopamine transporter protein (DAT) SC6A3_HUMAN Sodium-dependent dopamine transporter Solute carrier family 6 member 3
Type:
Multi-pass membrane protein
Mol. Mass.:
68497.11
Organism:
Homo sapiens (Human)
Description:
Q01959
Residue:
620
  
Inhibitor
Name:
BDBM50062915
Synonyms:
CHEMBL827 methyl (2R)-phenyl[(2R)-piperidin-2-yl]acetate | methyl (R)-phenyl[(R)-piperidin-2-yl]acetate
Type:
Small organic molecule
Emp. Form.:
C14H19NO2
Mol. Mass.:
233.3062
SMILES:
COC(=O)[C@@H]([C@H]1CCCCN1)c1ccccc1
: