Target
Mitogen-activated protein kinase kinase kinase 5
Ligand
BDBM50334269
Substrate
Meas. Tech.
ChEMBL_699648 (CHEMBL1648128)
IC50
15±n/a nM
Citation
 Okamoto, MSaito, NKojima, HOkabe, TTakeda, KIchijo, HFuruya, TNagano, T Identification of novel ASK1 inhibitors using virtual screening. Bioorg Med Chem 19:486-9 (2011)  
Target
Name:
Mitogen-activated protein kinase kinase kinase 5
Synonyms:
ASK1 MAP3K5 MEKK5
Type:
Protein
Mol. Mass.:
154514.93
Organism:
Homo sapiens (Human)
Description:
Q99683
Residue:
1374
  
Inhibitor
Name:
BDBM50334269
Synonyms:
4-tert-butyl-N-(imidazo[1,2-a]quinolin-2-yl)benzamide | CHEMBL1642656
Type:
Small organic molecule
Emp. Form.:
C22H21N3O
Mol. Mass.:
343.4216
SMILES:
CC(C)(C)c1ccc(cc1)C(=O)Nc1cn2c(ccc3ccccc23)n1
: