Target
Cyclin-dependent kinase 5 activator 1
Ligand
BDBM76780
Substrate
Meas. Tech.
ChEMBL_700097 (CHEMBL1646979)
IC50
>10000±n/a nM
Citation
 Jain, PFlaherty, PTYi, SChopra, IBleasdell, GLipay, JFerandin, YMeijer, LMadura, JD Design, synthesis, and testing of an 6-O-linked series of benzimidazole based inhibitors of CDK5/p25. Bioorg Med Chem 19:359-73 (2011)  
Target
Name:
Cyclin-dependent kinase 5 activator 1
Synonyms:
CDK5/p35 Cyclin-dependent kinase 5 regulatory subunit 1 | Cyclin-dependent kinase 5/CDK5 activator 1
Type:
Protein Complex
Mol. Mass.:
Description:
Components:
This complex has 2 components.
Component 1
Name:
Cyclin-dependent kinase 5
Synonyms:
CDK5 CDKN5 Cyclin-dependent kinase 5 (CDK5/ p25) Cyclin-dependent-like kinase 5 PSSALRE Tau protein kinase II catalytic subunit
Type:
Enzyme Subunit
Mol. Mass.:
33308.61
Organism:
Homo sapiens (Human)
Description:
Residue:
292
  
Component 2
Name:
Cyclin-dependent kinase 5 activator 1
Synonyms:
CD5R1_HUMAN CDK5R1 Cyclin-dependent kinase 5 (CDK5/p25) NCK5A p35
Type:
Enzyme Subunit
Mol. Mass.:
34077.43
Organism:
Homo sapiens (Human)
Description:
Q15078
Residue:
307
  
Inhibitor
Name:
BDBM76780
Synonyms:
6-(1-methoxybutan-2-yloxy)-N-(phenylmethyl)-1-propan-2-yl-4-benzimidazolamine MLS002471443 SMR001395109 cid_44143084
Type:
Small organic molecule
Emp. Form.:
C22H29N3O2
Mol. Mass.:
367.4846
SMILES:
CCC(COC)Oc1cc(NCc2ccccc2)c2ncn(C(C)C)c2c1
: