Target
Beta-carbonic anhydrase 1
Ligand
BDBM50334355
Substrate
Meas. Tech.
ChEMBL_700107 (CHEMBL1646989)
Ki
7.5±n/a nM
Citation
 Pacchiano, FCarta, FVullo, DScozzafava, ASupuran, CT Inhibition ofß-carbonic anhydrases with ureido-substituted benzenesulfonamides. Bioorg Med Chem Lett 21:102-5 (2010)  
Target
Name:
Beta-carbonic anhydrase 1
Synonyms:
β-Carbonic anhydrase 1 (CA 1) MTCA1_MYCTU canA | mtcA1
Type:
Enzyme
Mol. Mass.:
18186.06
Organism:
Mycobacterium tuberculosis
Description:
The recombinant GST-mtCA1 construct was cloned, expressed, and further purified from E. coli. The purified protein was used in inhibition assays.
Residue:
163
  
Inhibitor
Name:
BDBM50334355
Synonyms:
4-(3-(4-bromophenyl)ureido)benzenesulfonamide CHEMBL1643291
Type:
Small organic molecule
Emp. Form.:
C13H12BrN3O3S
Mol. Mass.:
370.222
SMILES:
NS(=O)(=O)c1ccc(NC(=O)Nc2ccc(Br)cc2)cc1
: