Target
Beta-carbonic anhydrase 1
Ligand
BDBM50334364
Substrate
Meas. Tech.
ChEMBL_700107 (CHEMBL1646989)
Ki
35±n/a nM
Citation
 Pacchiano, FCarta, FVullo, DScozzafava, ASupuran, CT Inhibition ofß-carbonic anhydrases with ureido-substituted benzenesulfonamides. Bioorg Med Chem Lett 21:102-5 (2010)  
Target
Name:
Beta-carbonic anhydrase 1
Synonyms:
β-Carbonic anhydrase 1 (CA 1) MTCA1_MYCTU canA | mtcA1
Type:
Enzyme
Mol. Mass.:
18186.06
Organism:
Mycobacterium tuberculosis
Description:
The recombinant GST-mtCA1 construct was cloned, expressed, and further purified from E. coli. The purified protein was used in inhibition assays.
Residue:
163
  
Inhibitor
Name:
BDBM50334364
Synonyms:
4-(3-(4-butoxyphenyl)ureido)benzenesulfonamide CHEMBL1643298
Type:
Small organic molecule
Emp. Form.:
C17H21N3O4S
Mol. Mass.:
363.431
SMILES:
CCCCOc1ccc(NC(=O)Nc2ccc(cc2)S(N)(=O)=O)cc1
: