Target
5-hydroxytryptamine receptor 7
Ligand
BDBM50334518
Substrate
Meas. Tech.
ChEMBL_701285 (CHEMBL1648905)
Ki
107±n/a nM
Citation
 Rudolph, DADvorak, CADvorak, LNepomuceno, DBonaventure, PLovenberg, TWCarruthers, NI Novel tetrahydropyrido[3,2-c]pyrroles as 5-HT(7) antagonists. Bioorg Med Chem Lett 21:42-4 (2010)  
Target
Name:
5-hydroxytryptamine receptor 7
Synonyms:
5-HT-7 5-HT7 5-HT7S 5-hydroxytryptamine receptor 7 5HT7R_RAT GPRFO Serotonin (5-HT) receptor | Serotonin Receptor 7
Type:
G Protein-Coupled Receptor (GPCR)
Mol. Mass.:
49852.62
Organism:
Rattus norvegicus (rat)
Description:
Rat cloned 5-HT7R.
Residue:
448
  
Inhibitor
Name:
BDBM50334518
Synonyms:
1-benzyl-3-(4-chlorophenyl)-4,5,6,7-tetrahydro-1H-pyrrolo[3,2-c]pyridine | CHEMBL1644269
Type:
Small organic molecule
Emp. Form.:
C20H19ClN2
Mol. Mass.:
322.831
SMILES:
Clc1ccc(cc1)-c1cn(Cc2ccccc2)c2CCNCc12
: