Target
ALK tyrosine kinase receptor
Ligand
BDBM50334594
Substrate
Meas. Tech.
ChEMBL_698755 (CHEMBL1648480)
IC50
5±n/a nM
Citation
 Mesaros, EFBurke, JPParrish, JDDugan, BJAnzalone, AVAngeles, TSAlbom, MSAimone, LDQuail, MRWan, WLu, LHuang, ZAtor, MARuggeri, BACheng, MOtt, GRDorsey, BD Novel 2,3,4,5-tetrahydro-benzo[d]azepine derivatives of 2,4-diaminopyrimidine, selective and orally bioavailable ALK inhibitors with antitumor efficacy in ALCL mouse models. Bioorg Med Chem Lett 21:463-6 (2010)  
Target
Name:
ALK tyrosine kinase receptor
Synonyms:
ALK ALK_HUMAN CD_antigen: CD246
Type:
Protein
Mol. Mass.:
176453.10
Organism:
Homo sapiens (Human)
Description:
Q9UM73
Residue:
1620
  
Inhibitor
Name:
BDBM50334594
Synonyms:
2-(5-chloro-2-(2-methoxy-4-morpholinophenylamino)pyrimidin-4-ylamino)-N-methylbenzamide 2-[5-chloro-2-[2-methoxy-4-(4-morpholinyl)phenylamino]pyrimidin-4-ylamino]-N-methylbenzamide TAE226 US10774092, Example 12
Type:
Small organic molecule
Emp. Form.:
C23H25ClN6O3
Mol. Mass.:
468.936
SMILES:
CNC(=O)c1ccccc1Nc1nc(Nc2ccc(cc2OC)N2CCOCC2)ncc1Cl
: