Target
5-hydroxytryptamine receptor 6
Ligand
BDBM50334749
Substrate
Meas. Tech.
ChEMBL_699278 (CHEMBL1647098)
Ki
17±n/a nM
Citation
 Liu, KGRobichaud, AJGreenfield, AALo, JRGrosanu, CMattes, JFCai, YZhang, GMZhang, JYKowal, DMSmith, DLDi, LKerns, EHSchechter, LEComery, TA Identification of 3-sulfonylindazole derivatives as potent and selective 5-HT(6) antagonists. Bioorg Med Chem 19:650-62 (2011)  
Target
Name:
5-hydroxytryptamine receptor 6
Synonyms:
5-HT-6 5-hydroxytryptamine receptor 6 (5-HT-6) 5-hydroxytryptamine receptor 6 (5HT6) HTR6 Serotonin 6 (5-HT6) receptor | Serotonin Receptor 6
Type:
G Protein-Coupled Receptor (GPCR)
Mol. Mass.:
46968.43
Organism:
Homo sapiens (Human)
Description:
P50406
Residue:
440
  
Inhibitor
Name:
BDBM50334749
Synonyms:
CHEMBL1642854 | N1-(3-(Naphthalen-1-ylsulfonyl)-1H-indazol-6-yl)ethane-1,2-diamine HCl
Type:
Small organic molecule
Emp. Form.:
C19H18N4O2S
Mol. Mass.:
366.437
SMILES:
NCCNc1ccc2c(n[nH]c2c1)S(=O)(=O)c1cccc2ccccc12
: