Target
Cytochrome P450 2D6
Ligand
BDBM50334783
Substrate
Meas. Tech.
ChEMBL_699315 (CHEMBL1647135)
IC50
8±n/a nM
Citation
 Shao, LWang, FMalcolm, SCMa, JHewitt, MCCampbell, UCBush, LRSpicer, NAEngel, SRSaraswat, LDHardy, LWKoch, PSchreiber, RSpear, KLVarney, MA Synthesis and pharmacological evaluation of 4-(3,4-dichlorophenyl)-N-methyl-1,2,3,4-tetrahydronaphthalenyl amines as triple reuptake inhibitors. Bioorg Med Chem 19:663-76 (2011)  
Target
Name:
Cytochrome P450 2D6
Synonyms:
CP2D6_HUMAN CYP2DL1 Cytochrome P450 2D6 (CYP2D6) P450-DB1
Type:
Protein
Mol. Mass.:
55774.82
Organism:
Homo sapiens (Human)
Description:
P10635
Residue:
497
  
Inhibitor
Name:
BDBM50334783
Synonyms:
CHEMBL1642914 | trans-(1S,2S)-1-(3,4-dichlorophenyl)-N-methyl-1,2,3,4-tetrahydronaphthalen-2-amine
Type:
Small organic molecule
Emp. Form.:
C17H17Cl2N
Mol. Mass.:
306.23
SMILES:
CN[C@H]1CCc2ccccc2[C@@H]1c1ccc(Cl)c(Cl)c1
: