Target
3-oxo-5-alpha-steroid 4-dehydrogenase 2
Ligand
BDBM50334790
Substrate
Meas. Tech.
ChEMBL_699332 (CHEMBL1647250)
IC50
>1000±n/a nM
Citation
 Yao, ZXu, YZhang, MJiang, SNicklaus, MCLiao, C Discovery of a novel hybrid from finasteride and epristeride as 5a-reductase inhibitor. Bioorg Med Chem Lett 21:475-8 (2010)  
Target
Name:
3-oxo-5-alpha-steroid 4-dehydrogenase 2
Synonyms:
3-oxo-5-alpha-steroid 4-dehydrogenase 2 5α-Reductase 2 (5α-R2) SR type 2 Steroid 5-alpha-reductase Type II 5-alpha reductase
Type:
Enzyme
Mol. Mass.:
28406.59
Organism:
Homo sapiens (Human)
Description:
P31213
Residue:
254
  
Inhibitor
Name:
BDBM50334790
Synonyms:
(4aS,4bR,10bS,12aS)-8-hydroxy-12a-methyl-3,4,4a,4b,5,6,10b,11,12,12a-decahydronaphtho[2,1-f]quinolin-2(1H)-one | CHEMBL1642919
Type:
Small organic molecule
Emp. Form.:
C18H23NO2
Mol. Mass.:
285.3807
SMILES:
C[C@]12CC[C@H]3[C@@H](CCc4cc(O)ccc34)[C@@H]1CCC(=O)N2
: