Target
Beta-galactosidase
Ligand
BDBM50335387
Substrate
Meas. Tech.
ChEMBL_701784 (CHEMBL1656921)
IC50
350000±n/a nM
Citation
 Ghisaidoobe, ABikker, Pde Bruijn, ACGodschalk, FDRogaar, EGuijt, MCHagens, PHalma, JMHart, SMLuitjens, SBvan Rixel, VHWijzenbroek, MZweegers, TDonker-Koopman, WEStrijland, ABoot, RMarel, GvOverkleeft, HSAerts, JM Identification of Potent and Selective Glucosylceramide Synthase Inhibitors from a Library of N-Alkylated Iminosugars ACS Med Chem Lett 2:119-123 (2011)  
Target
Name:
Beta-galactosidase
Synonyms:
Acid beta-galactosidase Bgl Glb1 | Lactase
Type:
PROTEIN
Mol. Mass.:
73125.63
Organism:
Mus musculus
Description:
ChEMBL_701784
Residue:
647
  
Inhibitor
Name:
BDBM50335387
Synonyms:
CHEMBL1651633 | N-Nonoxypentyl-1-deoxynojirimycin
Type:
Small organic molecule
Emp. Form.:
C20H41NO5
Mol. Mass.:
375.5432
SMILES:
CCCCCCCCCOCCCCCN1C[C@H](O)[C@@H](O)[C@H](O)[C@H]1CO
: