Target
Aurora kinase A
Ligand
BDBM50045027
Substrate
Meas. Tech.
ChEMBL_715420 (CHEMBL1664805)
IC50
29000±n/a nM
Citation
 Lan, PChen, WNChen, WM Molecular modeling studies on imidazo[4,5-b]pyridine derivatives as Aurora A kinase inhibitors using 3D-QSAR and docking approaches. Eur J Med Chem 46:77-94 (2010)  
Target
Name:
Aurora kinase A
Synonyms:
AIK ARK1 AURKA AYK1 Aurora kinase A (AURA) Aurora kinase A (Aurora A) Aurora-related kinase 1 BTAK Breast-tumor-amplified kinase STK15 Serine/threonine kinase 15 Serine/threonine-protein kinase aurora A hARK1
Type:
Serine/threonine-protein kinase
Mol. Mass.:
45830.98
Organism:
Homo sapiens (Human)
Description:
O14965
Residue:
403
  
Inhibitor
Name:
BDBM50045027
Synonyms:
2-(2-Methoxy-phenyl)-3H-imidazo[4,5-b]pyridine; hydrochloride CHEMBL543042
Type:
Small organic molecule
Emp. Form.:
C13H11N3O
Mol. Mass.:
225.2459
SMILES:
COc1ccccc1-c1nc2ncccc2[nH]1
: