Target
Aurora kinase A
Ligand
BDBM50318591
Substrate
Meas. Tech.
ChEMBL_715420 (CHEMBL1664805)
IC50
40±n/a nM
Citation
 Lan, PChen, WNChen, WM Molecular modeling studies on imidazo[4,5-b]pyridine derivatives as Aurora A kinase inhibitors using 3D-QSAR and docking approaches. Eur J Med Chem 46:77-94 (2010)  
Target
Name:
Aurora kinase A
Synonyms:
AIK ARK1 AURKA AYK1 Aurora kinase A (AURA) Aurora kinase A (Aurora A) Aurora-related kinase 1 BTAK Breast-tumor-amplified kinase STK15 Serine/threonine kinase 15 Serine/threonine-protein kinase aurora A hARK1
Type:
Serine/threonine-protein kinase
Mol. Mass.:
45830.98
Organism:
Homo sapiens (Human)
Description:
O14965
Residue:
403
  
Inhibitor
Name:
BDBM50318591
Synonyms:
6-Bromo-7-[4-(4-chlorobenzyl)-piperazin-1-yl]-2-(4-methoxyphenyl)-3Himidazo[4,5-b]pyridine | CHEMBL1084067
Type:
Small organic molecule
Emp. Form.:
C24H23BrClN5O
Mol. Mass.:
512.829
SMILES:
COc1ccc(cc1)-c1nc2ncc(Br)c(N3CCN(Cc4ccc(Cl)cc4)CC3)c2[nH]1
: